Target
Urokinase-type plasminogen activator
Ligand
BDBM50014337
Substrate
Meas. Tech.
ChEMBL_213296 (CHEMBL814351)
Ki
54325±n/a nM
Citation
 Yang, HHenkin, JKim, KHGreer, J Selective inhibition of urokinase by substituted phenylguanidines: quantitative structure-activity relationship analyses. J Med Chem 33:2956-61 (1990)  
Target
Name:
Urokinase-type plasminogen activator
Synonyms:
3.4.21.73 U-plasminogen activator Urokinase Urokinase-type plasminogen activator chain B Urokinase-type plasminogen activator short chain A uPA
Type:
Enzyme
Mol. Mass.:
48528.62
Organism:
Homo sapiens (Human)
Description:
P00749
Residue:
431
  
Inhibitor
Name:
BDBM50014337
Synonyms:
1N-amino(immino)methyl-2-nitroaniline
Type:
Small organic molecule
Emp. Form.:
C7H9N4O2
Mol. Mass.:
181.1714
SMILES:
[#7]\[#6](-[#7])=[#7+]/c1ccccc1-[#7+](-[#8-])=O
: