Target
Plasminogen
Ligand
BDBM50014337
Substrate
Meas. Tech.
ChEMBL_155247 (CHEMBL764736)
Ki
<10000000±n/a nM
Citation
 Yang, HHenkin, JKim, KHGreer, J Selective inhibition of urokinase by substituted phenylguanidines: quantitative structure-activity relationship analyses. J Med Chem 33:2956-61 (1990)  
Target
Name:
Plasminogen
Synonyms:
Activation peptide PLG Plasmin Plasmin heavy chain A, short form | Plasmin light chain B
Type:
Enzyme
Mol. Mass.:
90579.18
Organism:
Homo sapiens (Human)
Description:
Residue:
810
  
Inhibitor
Name:
BDBM50014337
Synonyms:
1N-amino(immino)methyl-2-nitroaniline
Type:
Small organic molecule
Emp. Form.:
C7H9N4O2
Mol. Mass.:
181.1714
SMILES:
[#7]\[#6](-[#7])=[#7+]/c1ccccc1-[#7+](-[#8-])=O
: