Target
Serine protease 1
Ligand
BDBM50014337
Substrate
Meas. Tech.
ChEMBL_212556 (CHEMBL815775)
Ki
133045±n/a nM
Citation
 Yang, HHenkin, JKim, KHGreer, J Selective inhibition of urokinase by substituted phenylguanidines: quantitative structure-activity relationship analyses. J Med Chem 33:2956-61 (1990)  
Target
Name:
Serine protease 1
Synonyms:
Beta-Trypsin PRSS1 TRY1 TRYP1 Trypsin I
Type:
Enzyme
Mol. Mass.:
25790.52
Organism:
Bos taurus (bovine)
Description:
P00760
Residue:
246
  
Inhibitor
Name:
BDBM50014337
Synonyms:
1N-amino(immino)methyl-2-nitroaniline
Type:
Small organic molecule
Emp. Form.:
C7H9N4O2
Mol. Mass.:
181.1714
SMILES:
[#7]\[#6](-[#7])=[#7+]/c1ccccc1-[#7+](-[#8-])=O
: