Target
Platelet-activating factor receptor
Ligand
BDBM50014012
Substrate
Meas. Tech.
ChEBML_155157
Ki
913±n/a nM
Citation
 Sunkel, CEde Casa-Juana, MFSantos, LGómez, MMVillarroya, MGonzález-Morales, MAPriego, JGOrtega, MP 4-Alkyl-1,4-dihydropyridines derivatives as specific PAF-acether antagonists. J Med Chem 33:3205-10 (1991)  
Target
Name:
Platelet-activating factor receptor
Synonyms:
PAF-R PTAFR_CAVPO Platelet-activating factor receptor
Type:
Protein
Mol. Mass.:
39005.63
Organism:
Cavia porcellus
Description:
Residue:
342
  
Inhibitor
Name:
BDBM50014012
Synonyms:
2,4,6-Trimethyl-1,4-dihydro-pyridine-3,5-dicarboxylic acid 3-isopropyl ester 5-(2-phenylsulfanyl-ethyl) ester | CHEMBL108291
Type:
Small organic molecule
Emp. Form.:
C21H27NO4S
Mol. Mass.:
389.508
SMILES:
CC(C)OC(=O)C1C(C)C(C(=O)OCCSc2ccccc2)=C(C)N=C1C
: