Target
Mu-type opioid receptor
Ligand
BDBM50013620
Substrate
Meas. Tech.
ChEMBL_145286 (CHEMBL752955)
Ki
570±n/a nM
Citation
 Portoghese, PSSultana, MTakemori, AE Design of peptidomimetic delta opioid receptor antagonists using the message-address concept. J Med Chem 33:1714-20 (1990)  
Target
Name:
Mu-type opioid receptor
Synonyms:
M-OR-1 Mu opioid receptor OPIATE Mu OPRM_CAVPO
Type:
Enzyme Catalytic Domain
Mol. Mass.:
11165.58
Organism:
GUINEA PIG
Description:
P97266
Residue:
98
  
Inhibitor
Name:
BDBM50013620
Synonyms:
2-[2-{2-[2-(2-Amino-3-phenyl-propionylamino)-3-mercapto-3-methyl-butyrylamino]-acetylamino}-3-(4-hydroxy-phenyl)-propionylamino]-3-mercapto-3-methyl-butyric acid (DPLPE) | CHEMBL2372782
Type:
Small organic molecule
Emp. Form.:
C30H41N5O7S2
Mol. Mass.:
647.806
SMILES:
CC(C)(S)[C@@H](NC(=O)[C@H](Cc1ccc(O)cc1)NC(=O)CNC(=O)[C@H](NC(=O)[C@@H](N)Cc1ccccc1)C(C)(C)S)C(O)=O
: