Target
Adenosine receptor A2a/A2b
Ligand
BDBM82022
Substrate
Meas. Tech.
ChEMBL_30721 (CHEMBL646487)
Ki
71±n/a nM
Citation
 Hutchison, AJWilliams, Mde Jesus, RYokoyama, ROei, HHGhai, GRWebb, RLZoganas, HCStone, GAJarvis, MF 2-(Arylalkylamino)adenosin-5'-uronamides: a new class of highly selective adenosine A2 receptor ligands. J Med Chem 33:1919-24 (1990)  
Target
Name:
Adenosine receptor A2a/A2b
Synonyms:
Adenosine A2 receptor
Type:
Mol. Mass.:
Description:
ASSAY_ID of ChEMBL is 30560
Components:
This complex has 2 components.
Component 1
Name:
Adenosine receptor A2b
Synonyms:
AA2BR_RAT Adora2b
Type:
PROTEIN
Mol. Mass.:
36378.84
Organism:
Rattus norvegicus
Description:
ChEMBL_32934
Residue:
332
  
Component 2
Name:
Adenosine receptor A2a
Synonyms:
AA2AR_RAT Adenosine A2 receptor Adenosine Receptors A2a (A2a) Adenosine receptors A2a Rat striatal adenosine A2a receptor
Type:
G Protein-Coupled Receptor (GPCR)
Mol. Mass.:
45015.65
Organism:
Rattus norvegicus (rat)
Description:
Rat A2A receptors expressed in CHO cells.
Residue:
410
  
Inhibitor
Name:
BDBM82022
Synonyms:
2-(Phenylamino)ado (CV-1808) CHEMBL1256672 | N6-Phenylado
Type:
Emp. Form.:
C16H18N6O4
Mol. Mass.:
358.3519
SMILES:
Nc1nc(Nc2ccccc2)nc2n(cnc12)[C@@H]1O[C@H](CO)[C@@H](O)[C@H]1O
: