Target
Kappa-type opioid receptor
Ligand
BDBM50013854
Substrate
Meas. Tech.
ChEBML_146790
Ki
242±n/a nM
Citation
 Galzi, JLMejean, AIlien, BMollereau, CMeunier, JCGoeldner, MHirth, C Photoactivatable opiate derivatives as irreversible probes of the mu-opioid receptor. J Med Chem 33:2456-64 (1990)  
Target
Name:
Kappa-type opioid receptor
Synonyms:
Kappa Opioid Receptor OPRK1 Opiate Kappa 1 | mu/kappa opioid receptor
Type:
G Protein-Coupled Receptor (GPCR)
Mol. Mass.:
42744.99
Organism:
Cavia porcellus (domestic guinea pig)
Description:
P41144
Residue:
380
  
Inhibitor
Name:
BDBM50013854
Synonyms:
CHEMBL310829 | {2-[5-Azido-2-(4-ethoxy-benzyl)-benzoimidazol-1-yl]-ethyl}-diethyl-amine
Type:
Small organic molecule
Emp. Form.:
C22H28N6O
Mol. Mass.:
392.4973
SMILES:
CCOc1ccc(Cc2nc3cc(ccc3n2CCN(CC)CC)N=[N+]=[N-])cc1
: