Target
Mu-type opioid receptor
Ligand
BDBM50013847
Substrate
Meas. Tech.
ChEBML_149141
Ki
0.500000±n/a nM
Citation
 Galzi, JLMejean, AIlien, BMollereau, CMeunier, JCGoeldner, MHirth, C Photoactivatable opiate derivatives as irreversible probes of the mu-opioid receptor. J Med Chem 33:2456-64 (1990)  
Target
Name:
Mu-type opioid receptor
Synonyms:
MOR-1 Mu-type opioid receptor (MOR) OPRM_RAT Opioid receptor B Ror-b
Type:
G Protein-Coupled Receptor (GPCR)
Mol. Mass.:
44503.11
Organism:
Rattus norvegicus (rat)
Description:
Competition binding assays were carried out using membrane preparations from transfected HN9.10 cells that constitutively expressed the mu opioid receptor.
Residue:
398
  
Inhibitor
Name:
BDBM50013847
Synonyms:
CHEMBL312040 {2-[2-(4-Ethoxy-benzyl)-5-nitro-benzoimidazol-1-yl]-ethyl}-diethyl-amine
Type:
Small organic molecule
Emp. Form.:
C22H28N4O3
Mol. Mass.:
396.4827
SMILES:
CCOc1ccc(Cc2nc3cc(ccc3n2CCN(CC)CC)[N+]([O-])=O)cc1
: