Target
Mu-type opioid receptor
Ligand
BDBM50013848
Substrate
Meas. Tech.
ChEBML_149141
Ki
4±n/a nM
Citation
 Galzi, JLMejean, AIlien, BMollereau, CMeunier, JCGoeldner, MHirth, C Photoactivatable opiate derivatives as irreversible probes of the mu-opioid receptor. J Med Chem 33:2456-64 (1990)  
Target
Name:
Mu-type opioid receptor
Synonyms:
MOR-1 Mu-type opioid receptor (MOR) OPRM_RAT Opioid receptor B Ror-b
Type:
G Protein-Coupled Receptor (GPCR)
Mol. Mass.:
44503.11
Organism:
Rattus norvegicus (rat)
Description:
Competition binding assays were carried out using membrane preparations from transfected HN9.10 cells that constitutively expressed the mu opioid receptor.
Residue:
398
  
Inhibitor
Name:
BDBM50013848
Synonyms:
8-[1-(4-Chloro-phenyl)-ethyl]-1-phenyl-1,3,8-triaza-spiro[4.5]decan-4-one | CHEMBL312281
Type:
Small organic molecule
Emp. Form.:
C21H24ClN3O
Mol. Mass.:
369.888
SMILES:
CC(N1CCC2(CC1)N(CNC2=O)c1ccccc1)c1ccc(Cl)cc1
: