Target
Delta-type opioid receptor
Ligand
BDBM50013855
Substrate
Meas. Tech.
ChEBML_145688
Ki
100±n/a nM
Citation
 Galzi, JLMejean, AIlien, BMollereau, CMeunier, JCGoeldner, MHirth, C Photoactivatable opiate derivatives as irreversible probes of the mu-opioid receptor. J Med Chem 33:2456-64 (1990)  
Target
Name:
Delta-type opioid receptor
Synonyms:
Cytochrome P450 3A4 Delta opioid receptor Delta-type opioid receptor (DOR) OPRD_RAT Opioid receptor Opioid receptors; mu & delta Ror-a | Voltage-gated potassium channel
Type:
G Protein-Coupled Receptor (GPCR)
Mol. Mass.:
40465.04
Organism:
Rattus norvegicus (rat)
Description:
Competition binding assays were using CHO-K1 cell membranes expressing the opioid receptor.
Residue:
372
  
Inhibitor
Name:
BDBM50013855
Synonyms:
1-(4-Azido-phenyl)-8-[1-(4-chloro-phenyl)-ethyl]-1,3,8-triaza-spiro[4.5]decan-4-one | CHEMBL312046
Type:
Small organic molecule
Emp. Form.:
C21H23ClN6O
Mol. Mass.:
410.9
SMILES:
CC(N1CCC2(CC1)N(CNC2=O)c1ccc(cc1)N=[N+]=[N-])c1ccc(Cl)cc1
: