Target
Mu-type opioid receptor
Ligand
BDBM50013853
Substrate
Meas. Tech.
ChEBML_149141
Ki
8±n/a nM
Citation
 Galzi, JLMejean, AIlien, BMollereau, CMeunier, JCGoeldner, MHirth, C Photoactivatable opiate derivatives as irreversible probes of the mu-opioid receptor. J Med Chem 33:2456-64 (1990)  
Target
Name:
Mu-type opioid receptor
Synonyms:
MOR-1 Mu-type opioid receptor (MOR) OPRM_RAT Opioid receptor B Ror-b
Type:
G Protein-Coupled Receptor (GPCR)
Mol. Mass.:
44503.11
Organism:
Rattus norvegicus (rat)
Description:
Competition binding assays were carried out using membrane preparations from transfected HN9.10 cells that constitutively expressed the mu opioid receptor.
Residue:
398
  
Inhibitor
Name:
BDBM50013853
Synonyms:
1-[2-(4-Azido-phenyl)-ethyl]-4-(phenyl-propionyl-amino)-piperidine-4-carboxylic acid methyl ester | CHEMBL81328
Type:
Small organic molecule
Emp. Form.:
C24H29N5O3
Mol. Mass.:
435.5188
SMILES:
CCC(=O)N(c1ccccc1)C1(CCN(CCc2ccc(cc2)N=[N+]=[N-])CC1)C(=O)OC
: