Target
Mu-type opioid receptor
Ligand
BDBM50013857
Substrate
Meas. Tech.
ChEBML_149141
Ki
0.600000±n/a nM
Citation
 Galzi, JLMejean, AIlien, BMollereau, CMeunier, JCGoeldner, MHirth, C Photoactivatable opiate derivatives as irreversible probes of the mu-opioid receptor. J Med Chem 33:2456-64 (1990)  
Target
Name:
Mu-type opioid receptor
Synonyms:
MOR-1 Mu-type opioid receptor (MOR) OPRM_RAT Opioid receptor B Ror-b
Type:
G Protein-Coupled Receptor (GPCR)
Mol. Mass.:
44503.11
Organism:
Rattus norvegicus (rat)
Description:
Competition binding assays were carried out using membrane preparations from transfected HN9.10 cells that constitutively expressed the mu opioid receptor.
Residue:
398
  
Inhibitor
Name:
BDBM50013857
Synonyms:
14-[4-diazo(methyl)anilino]-4-cyclopropylmethyl-12-oxa-4-azapentacyclo[9.6.1.01,13.05,17.07,18]octadeca-7(18),8,10-triene-10,17-diol salt (naltrexonediazonium) | CHEMBL311995
Type:
Small organic molecule
Emp. Form.:
C27H31N4O3
Mol. Mass.:
459.5595
SMILES:
CN(C1CCC2(O)C3Cc4ccc(O)c5OC1C2(CCN3CC1CC1)c45)c1ccc(cc1)[N+]#N
: