Target
Kappa-type opioid receptor
Ligand
BDBM50008858
Substrate
Meas. Tech.
ChEMBL_146527 (CHEMBL753839)
Ki
0.830000±n/a nM
Citation
 Halfpenny, PRHorwell, DCHughes, JHumblet, CHunter, JCNeuhaus, DRees, DC Highly selective kappa opioid analgesics. 4. Synthesis of some conformationally restricted naphthalene derivatives with high receptor affinity and selectivity. J Med Chem 34:190-4 (1991)  
Target
Name:
Kappa-type opioid receptor
Synonyms:
Kappa Opioid Receptor OPRK1 Opiate Kappa 1 | mu/kappa opioid receptor
Type:
G Protein-Coupled Receptor (GPCR)
Mol. Mass.:
42744.99
Organism:
Cavia porcellus (domestic guinea pig)
Description:
P41144
Residue:
380
  
Inhibitor
Name:
BDBM50008858
Synonyms:
2-Benzofuran-4-yl-N-methyl-N-(7-pyrrolidin-1-yl-1-oxa-spiro[4.5]dec-8-yl)-acetamide; hydrochloride | CHEMBL539246
Type:
Small organic molecule
Emp. Form.:
C24H32N2O3
Mol. Mass.:
396.5225
SMILES:
CN([C@H]1CCC2(CCCO2)C[C@@H]1N1CCCC1)C(=O)Cc1cccc2occc12
: