Target
Alpha-2A adrenergic receptor [16-465]/Alpha-2B adrenergic receptor/Alpha-2C adrenergic receptor
Ligand
BDBM50007428
Substrate
Meas. Tech.
ChEMBL_34047 (CHEMBL645290)
IC50
2600±n/a nM
Citation
 Jaen, JCWise, LDHeffner, TGPugsley, TAMeltzer, LT Dopamine autoreceptor agonists as potential antipsychotics. 2. (Aminoalkoxy)-4H-1-benzopyran-4-ones. J Med Chem 34:248-56 (1991)  
Target
Name:
Alpha-2A adrenergic receptor [16-465]/Alpha-2B adrenergic receptor/Alpha-2C adrenergic receptor
Synonyms:
Adrenergic receptor alpha-2
Type:
Mol. Mass.:
Description:
ASSAY_ID of ChEMBL is 935397
Components:
This complex has 3 components.
Component 1
Name:
Alpha-2C adrenergic receptor
Synonyms:
ADA2C_RAT Adrenergic receptor alpha adrenergic Alpha2 | adrenergic Alpha2C
Type:
Enzyme Catalytic Domain
Mol. Mass.:
49890.50
Organism:
RAT
Description:
adrenergic Alpha2 0 RAT::P22086
Residue:
458
  
Component 2
Name:
Alpha-2B adrenergic receptor
Synonyms:
ADA2B_RAT Adrenergic receptor alpha Alpha-2B adrenergic receptor Alpha-2B adrenoreceptor | adrenergic Alpha2B
Type:
Enzyme Catalytic Domain
Mol. Mass.:
50379.83
Organism:
NEONATAL RAT
Description:
adrenergic Alpha2B ADRA2B NEONATAL RAT::P19328
Residue:
453
  
Component 3
Name:
Alpha-2A adrenergic receptor [16-465]
Synonyms:
ADA2A_RAT Adrenaline 2 Alpha-2A adrenoceptor Alpha-2AAR Alpha2 Adrenoreceptor adrenergic Alpha2A
Type:
G-protein coupled receptor
Mol. Mass.:
48961.69
Organism:
Rattus norvegicus (rat)
Description:
P22909[16-465]
Residue:
450
  
Inhibitor
Name:
BDBM50007428
Synonyms:
7-[3-(4-Pyridin-2-yl-piperazin-1-yl)-propoxy]-chromen-4-one | CHEMBL84639
Type:
Small organic molecule
Emp. Form.:
C21H23N3O3
Mol. Mass.:
365.4256
SMILES:
O=c1ccoc2cc(OCCCN3CCN(CC3)c3ccccn3)ccc12
: