Target
3-hydroxy-3-methylglutaryl-coenzyme A reductase
Ligand
BDBM50007255
Substrate
Meas. Tech.
ChEBML_78556
IC50
30±n/a nM
Citation
 Jendralla, HGranzer, Evon Kerekjarto, BKrause, RSchacht, UBaader, EBartmann, WBeck, GBergmann, AKesseler, K Synthesis and biological activity of new HMG-CoA reductase inhibitors. 3. Lactones of 6-phenoxy-3,5-dihydroxyhexanoic acids. J Med Chem 34:2962-83 (1991)  
Target
Name:
3-hydroxy-3-methylglutaryl-coenzyme A reductase
Synonyms:
3-hydroxy-3-methylglutaryl-coenzyme A (HMG-CoA) reductase HMDH_HUMAN HMG-CoA reductase (HMGR) | HMGCR
Type:
Enzyme
Mol. Mass.:
97477.10
Organism:
Homo sapiens (Human)
Description:
P04035
Residue:
888
  
Inhibitor
Name:
BDBM50007255
Synonyms:
CHEMBL100165 | Sodium; 6-(4'-fluoro-3,5-diisopropyl-biphenyl-2-yloxy)-3,5-dihydroxy-hexanoate
Type:
Small organic molecule
Emp. Form.:
C24H30FO5
Mol. Mass.:
417.491
SMILES:
CC(C)c1cc(C(C)C)c(OCC(O)C[C@@H](O)CC([O-])=O)c(c1)-c1ccc(F)cc1
: