Target
Adenosine receptor A2a/A2b
Ligand
BDBM50449718
Substrate
Meas. Tech.
ChEMBL_31030 (CHEMBL638319)
Ki
3000±n/a nM
Citation
 Thompson, RDSecunda, SDaly, JWOlsson, RA Activity of N6-substituted 2-chloroadenosines at A1 and A2 adenosine receptors. J Med Chem 34:3388-90 (1992)  
Target
Name:
Adenosine receptor A2a/A2b
Synonyms:
Adenosine A2 receptor
Type:
Mol. Mass.:
Description:
ASSAY_ID of ChEMBL is 30560
Components:
This complex has 2 components.
Component 1
Name:
Adenosine receptor A2b
Synonyms:
AA2BR_RAT Adora2b
Type:
PROTEIN
Mol. Mass.:
36378.84
Organism:
Rattus norvegicus
Description:
ChEMBL_32934
Residue:
332
  
Component 2
Name:
Adenosine receptor A2a
Synonyms:
AA2AR_RAT Adenosine A2 receptor Adenosine Receptors A2a (A2a) Adenosine receptors A2a Rat striatal adenosine A2a receptor
Type:
G Protein-Coupled Receptor (GPCR)
Mol. Mass.:
45015.65
Organism:
Rattus norvegicus (rat)
Description:
Rat A2A receptors expressed in CHO cells.
Residue:
410
  
Inhibitor
Name:
BDBM50449718
Synonyms:
CHEMBL312917
Type:
Small organic molecule
Emp. Form.:
C19H22ClN5O4
Mol. Mass.:
419.862
SMILES:
C[C@@H](Cc1ccccc1)Nc1nc(Cl)nc2n(cnc12)[C@@H]1O[C@H](CO)[C@@H](O)[C@H]1O
: