Target
Angiotensin-converting enzyme
Ligand
BDBM50367258
Substrate
Meas. Tech.
ChEBML_35989
IC50
2.9±n/a nM
Citation
 Hausin, RJCodding, PW Molecular and crystal structures of MDL27,467A hydrochloride and quinapril hydrochloride, two ester derivatives of potent angiotensin converting enzyme inhibitors. J Med Chem 34:511-7 (1991)  
Target
Name:
Angiotensin-converting enzyme
Synonyms:
ACE Angiotensin converting enzyme (ACE) Angiotensin-converting enzyme, soluble form CD_antigen=CD143 DCP1 Kininase II
Type:
Enzyme
Mol. Mass.:
149709.01
Organism:
Homo sapiens (Human)
Description:
Residue:
1306
  
Inhibitor
Name:
BDBM50367258
Synonyms:
CI-928 | QUINAPRILAT
Type:
Small organic molecule
Emp. Form.:
C23H26N2O5
Mol. Mass.:
410.4629
SMILES:
C[C@H](N[C@@H](CCc1ccccc1)C(O)=O)C(=O)N1Cc2ccccc2C[C@H]1C(O)=O
: