Target
D(2) dopamine receptor
Ligand
BDBM50007533
Substrate
Meas. Tech.
ChEBML_61427
IC50
9.4±n/a nM
Citation
 Högberg, TStröm, Pde Paulis, TStensland, BCsöregh, ILundin, KHall, HOgren, SO Potential antipsychotic agents. 9. Synthesis and stereoselective dopamine D-2 receptor blockade of a potent class of substituted (R)-N-[(1-benzyl-2-pyrrolidinyl)methyl]benzamides. Relations to other side chain congeners. J Med Chem 34:948-55 (1991)  
Target
Name:
D(2) dopamine receptor
Synonyms:
DOPAMINE D2 DOPAMINE D2 Short Dopamine D2 receptor Drd2
Type:
G Protein-Coupled Receptor (GPCR)
Mol. Mass.:
50931.60
Organism:
Rattus norvegicus (rat)
Description:
P61169
Residue:
444
  
Inhibitor
Name:
BDBM50007533
Synonyms:
CHEMBL173536 | N-(1-Benzyl-piperidin-4-yl)-3-chloro-5-ethyl-6-hydroxy-2-methoxy-benzamide
Type:
Small organic molecule
Emp. Form.:
C22H27ClN2O3
Mol. Mass.:
402.914
SMILES:
CCc1cc(Cl)c(OC)c(C(=O)NC2CCN(Cc3ccccc3)CC2)c1O
: