Target
Delta-type opioid receptor
Ligand
BDBM50009130
Substrate
Meas. Tech.
ChEBML_145185
Ki
10±n/a nM
Citation
 Portoghese, PSGarzon-Aburbeh, ANagase, HLin, CETakemori, AE Role of the spacer in conferring kappa opioid receptor selectivity to bivalent ligands related to norbinaltorphimine. J Med Chem 34:1292-6 (1991)  
Target
Name:
Delta-type opioid receptor
Synonyms:
D-OR-1 Delta opioid receptor OPIATE Delta OPRD1 OPRK1 | opioid receptor, delta 1
Type:
G Protein-Coupled Receptor (GPCR)
Mol. Mass.:
40382.98
Organism:
Homo sapiens (Human)
Description:
Competition binding assays were carried out using membrane preparations from transfected HN9.10 cells that constitutively expressed the delta opioid receptor.
Residue:
372
  
Inhibitor
Name:
BDBM50009130
Synonyms:
bis(4-cyclopropylmethyl-12-oxa-4-azapentacyclo[9.6.1.01,13.05,17.07,18]octadeca-7(18),8,10,14-tetraene-10,17-diol)4-phenyl-4H-pyran
Type:
Small organic molecule
Emp. Form.:
C47H48N2O7
Mol. Mass.:
752.8932
SMILES:
Oc1ccc2CC3N(CC4CC4)CC[C@@]45[C@@H](Oc1c24)C1=C(C[C@@]35O)C(C2=C(O1)[C@@H]1Oc3c4c(CC5N(CC6CC6)CC[C@@]14[C@@]5(O)C2)ccc3O)c1ccccc1
: