Target
Cathepsin D
Ligand
BDBM50008149
Substrate
Meas. Tech.
ChEBML_44987
IC50
19±n/a nM
Citation
 Doherty, AMSircar, IKornberg, BEQuin, JWinters, RTKaltenbronn, JSTaylor, MDBatley, BLRapundalo, SRRyan, MJ Design and synthesis of potent, selective, and orally active fluorine-containing renin inhibitors. J Med Chem 35:2-14 (1992)  
Target
Name:
Cathepsin D
Synonyms:
CATD_BOVIN | CTSD
Type:
PROTEIN
Mol. Mass.:
42158.92
Organism:
Bos taurus
Description:
ChEMBL_1458606
Residue:
387
  
Inhibitor
Name:
BDBM50008149
Synonyms:
2-[2-(Morpholine-4-sulfonylamino)-3-phenyl-propionylamino]-pent-4-enoic acid [1-cyclohexylmethyl-3-(2-ethylsulfanyl-propylcarbamoyl)-3,3-difluoro-2-oxo-propyl]-amide | CHEMBL30920
Type:
Small organic molecule
Emp. Form.:
C34H51F2N5O7S2
Mol. Mass.:
743.925
SMILES:
CCS[C@H](C)CNC(=O)C(F)(F)C(=O)[C@H](CC1CCCCC1)NC(=O)[C@H](CC=C)NC(=O)[C@H](Cc1ccccc1)NS(=O)(=O)N1CCOCC1
: