Target
Cholecystokinin receptor type A
Ligand
BDBM50002523
Substrate
Meas. Tech.
ChEBML_49717
IC50
3.4±n/a nM
Citation
 Shiosaki, KLin, CWKopecka, HCraig, RABianchi, BRMiller, TRWitte, DGStashko, MNadzan, AM Development of potent and selective CCK-A receptor agonists from Boc-CCK-4: tetrapeptides containing Lys(N epsilon)-amide residues. J Med Chem 35:2007-14 (1992)  
Target
Name:
Cholecystokinin receptor type A
Synonyms:
CCK-A receptor CCK1-R CCKAR_CAVPO Cholecystokinin receptor type A | Cholecystokinin-1 receptor
Type:
Mol. Mass.:
48229.77
Organism:
Cavia porcellus
Description:
Residue:
430
  
Inhibitor
Name:
BDBM50002523
Synonyms:
3-{6-[(6-Acetoxy-naphthalene-2-carbonyl)-amino]-2-[2-tert-butoxycarbonylamino-3-(1H-indol-3-yl)-propionylamino]-hexanoylamino}-N-(1-carbamoyl-2-phenyl-ethyl)-N-methyl-succinamic acid; hydrate | CHEMBL294542
Type:
Small organic molecule
Emp. Form.:
C49H57N7O11
Mol. Mass.:
920.0172
SMILES:
CN([C@@H](Cc1ccccc1)C(N)=O)C(=O)[C@H](CC(O)=O)NC(=O)[C@H](CCCCNC(=O)c1ccc2cc(OC(C)=O)ccc2c1)NC(=O)[C@H](Cc1c[nH]c2ccccc12)NC(=O)OC(C)(C)C
: