Target
Kappa-type opioid receptor
Ligand
BDBM50037480
Substrate
Meas. Tech.
ChEMBL_145220 (CHEMBL755517)
Ki
1988±n/a nM
Citation
 de Costa, BRadesca, LDominguez, CDi Paolo, LBowen, WD Synthesis and receptor binding properties of fluoro- and iodo-substituted high affinity sigma receptor ligands: identification of potential PET and SPECT sigma receptor imaging agents. J Med Chem 35:2221-30 (1992)  
Target
Name:
Kappa-type opioid receptor
Synonyms:
Kappa Opioid Receptor OPRK1 Opiate Kappa 1 | mu/kappa opioid receptor
Type:
G Protein-Coupled Receptor (GPCR)
Mol. Mass.:
42744.99
Organism:
Cavia porcellus (domestic guinea pig)
Description:
P41144
Residue:
380
  
Inhibitor
Name:
BDBM50037480
Synonyms:
(6R,11S)-6,11-Dimethyl-3-pentyl-1,2,3,4,5,6-hexahydro-2,6-methano-benzo[d]azocin-8-ol | CHEMBL324392
Type:
Small organic molecule
Emp. Form.:
C19H29NO
Mol. Mass.:
287.4397
SMILES:
CCCCCN1CC[C@]2(C)[C@H](C)C1Cc1ccc(O)cc21
: