Target
Sigma non-opioid intracellular receptor 1
Ligand
BDBM50000771
Substrate
Meas. Tech.
ChEBML_226553
Ki
1.23±n/a nM
Citation
 de Costa, BRadesca, LDominguez, CDi Paolo, LBowen, WD Synthesis and receptor binding properties of fluoro- and iodo-substituted high affinity sigma receptor ligands: identification of potential PET and SPECT sigma receptor imaging agents. J Med Chem 35:2221-30 (1992)  
Target
Name:
Sigma non-opioid intracellular receptor 1
Synonyms:
Aging-associated gene 8 protein SGMR1_HUMAN SIGMAR1 SR31747-binding protein Sigma 1-type opioid receptor Sigma1R | hSigmaR1
Type:
Enzyme Catalytic Domain
Mol. Mass.:
25124.85
Organism:
Homo sapiens (Human)
Description:
Q99720
Residue:
223
  
Inhibitor
Name:
BDBM50000771
Synonyms:
CHEMBL71049 | [2-(4,5-Dichloro-2-iodo-phenyl)-ethyl]-methyl-(2-pyrrolidin-1-yl-ethyl)-amine
Type:
Small organic molecule
Emp. Form.:
C15H21Cl2IN2
Mol. Mass.:
427.151
SMILES:
CN(CCN1CCCC1)CCc1cc(Cl)c(Cl)cc1I
: