Target
Kappa-type opioid receptor
Ligand
BDBM50000772
Substrate
Meas. Tech.
ChEBML_146362
Ki
10478±n/a nM
Citation
 de Costa, BRadesca, LDominguez, CDi Paolo, LBowen, WD Synthesis and receptor binding properties of fluoro- and iodo-substituted high affinity sigma receptor ligands: identification of potential PET and SPECT sigma receptor imaging agents. J Med Chem 35:2221-30 (1992)  
Target
Name:
Kappa-type opioid receptor
Synonyms:
Kappa Opioid Receptor OPRK1 Opiate Kappa 1 | mu/kappa opioid receptor
Type:
G Protein-Coupled Receptor (GPCR)
Mol. Mass.:
42744.99
Organism:
Cavia porcellus (domestic guinea pig)
Description:
P41144
Residue:
380
  
Inhibitor
Name:
BDBM50000772
Synonyms:
CHEMBL70861 | [2-(3,4-Dichloro-phenyl)-ethyl]-(3-fluoro-propyl)-(2-pyrrolidin-1-yl-ethyl)-amine
Type:
Small organic molecule
Emp. Form.:
C17H25Cl2FN2
Mol. Mass.:
347.298
SMILES:
FCCCN(CCN1CCCC1)CCc1ccc(Cl)c(Cl)c1
: