Target
D(2) dopamine receptor
Ligand
BDBM50000776
Substrate
Meas. Tech.
ChEBML_62224
Ki
2902±n/a nM
Citation
 de Costa, BRadesca, LDominguez, CDi Paolo, LBowen, WD Synthesis and receptor binding properties of fluoro- and iodo-substituted high affinity sigma receptor ligands: identification of potential PET and SPECT sigma receptor imaging agents. J Med Chem 35:2221-30 (1992)  
Target
Name:
D(2) dopamine receptor
Synonyms:
DOPAMINE D2 DOPAMINE D2 Short Dopamine D2 receptor Drd2
Type:
G Protein-Coupled Receptor (GPCR)
Mol. Mass.:
50931.60
Organism:
Rattus norvegicus (rat)
Description:
P61169
Residue:
444
  
Inhibitor
Name:
BDBM50000776
Synonyms:
1-[2-(3,4-Dichloro-phenyl)-ethyl]-4-propyl-piperazine | CHEMBL70807
Type:
Small organic molecule
Emp. Form.:
C15H22Cl2N2
Mol. Mass.:
301.255
SMILES:
CCCN1CCN(CCc2ccc(Cl)c(Cl)c2)CC1
: