Target
Delta-type opioid receptor
Ligand
BDBM50001089
Substrate
Meas. Tech.
ChEBML_147048
Ki
45±n/a nM
Citation
 Chandrakumar, NSStapelfeld, ABeardsley, PMLopez, OTDrury, BAnthony, ESavage, MAWilliamson, LNReichman, M Analogs of the delta opioid receptor selective cyclic peptide [2-D-penicillamine,5-D-penicillamine]-enkephalin: 2',6'-dimethyltyrosine and Gly3-Phe4 amide bond isostere substitutions. J Med Chem 35:2928-38 (1992)  
Target
Name:
Delta-type opioid receptor
Synonyms:
Cytochrome P450 3A4 Delta opioid receptor Delta-type opioid receptor (DOR) OPRD_RAT Opioid receptor Opioid receptors; mu & delta Ror-a | Voltage-gated potassium channel
Type:
G Protein-Coupled Receptor (GPCR)
Mol. Mass.:
40465.04
Organism:
Rattus norvegicus (rat)
Description:
Competition binding assays were using CHO-K1 cell membranes expressing the opioid receptor.
Residue:
372
  
Inhibitor
Name:
BDBM50001089
Synonyms:
13-[2-Amino-3-(4-hydroxy-2,6-dimethyl-phenyl)-propionylamino]-7-benzyl-3,3,14,14-tetramethyl-6,12-dioxo-1,2-dithia-5,11-diaza-cyclotetradec-8-ene-4-carboxylic acid methyl ester; hydrochloride | CHEMBL541570
Type:
Small organic molecule
Emp. Form.:
C34H46N4O6S2
Mol. Mass.:
670.882
SMILES:
COC(=O)[C@H]1NC(=O)C(Cc2ccccc2)\C=C/CNC(=O)[C@@H](NC(=O)[C@@H](N)Cc2c(C)cc(O)cc2C)C(C)(C)SSC1(C)C
: