Target
Cysteinyl leukotriene receptor 1
Ligand
BDBM50001280
Substrate
Meas. Tech.
ChEMBL_52046 (CHEMBL666432)
IC50
3300±n/a nM
Citation
 Zamboni, RBelley, MChampion, ECharette, LDeHaven, RFrenette, RGauthier, JYJones, TRLeger, SMasson, P Development of a novel series of styrylquinoline compounds as high-affinity leukotriene D4 receptor antagonists: synthetic and structure-activity studies leading to the discovery of (+-)-3-[[[3-[2-(7-chloro-2-quinolinyl)-(E)-ethenyl]phenyl][[3- (dimethylamino)-3-oxopropyl]thio]methyl]thio]propionic J Med Chem 35:3832-44 (1992)  
Target
Name:
Cysteinyl leukotriene receptor 1
Synonyms:
CLTR1_CAVPO | CYSLTR1
Type:
Enzyme Catalytic Domain
Mol. Mass.:
39007.58
Organism:
GUINEA PIG
Description:
Leukotriene D4 0 GUINEA PIG::Q2NNR5
Residue:
340
  
Inhibitor
Name:
BDBM50001280
Synonyms:
2-(2-Pyridin-4-yl-vinyl)-quinoline | CHEMBL338876
Type:
Small organic molecule
Emp. Form.:
C16H12N2
Mol. Mass.:
232.2799
SMILES:
C(=C/c1ccc2ccccc2n1)\c1ccncc1
: