Target
Alpha-1A adrenergic receptor
Ligand
BDBM50003335
Substrate
Meas. Tech.
ChEBML_32976
IC50
1500±n/a nM
Citation
 Elliott, JMSelnick, HGClaremon, DABaldwin, JJBuhrow, SAButcher, JWHabecker, CNKing, SWLynch, JJPhillips, BT 4-Oxospiro[benzopyran-2,4'-piperidines] as class III antiarrhythmic agents. Pharmacological studies on 3,4-dihydro-1'-[2-(benzofurazan-5-yl)- ethyl]-6-methanesulfonamidospiro[(2H)-1-benzopyran-2,4'-piperidin]-4-on e (L-691,121). J Med Chem 35:3973-6 (1992)  
Target
Name:
Alpha-1A adrenergic receptor
Synonyms:
ADA1A_BOVIN ADRA1C Alpha 1A-adrenoreceptor Cerebral cortex alpha adrenergic receptor | adrenergic Alpha1
Type:
Enzyme Catalytic Domain
Mol. Mass.:
51492.08
Organism:
CALF
Description:
adrenergic Alpha1 0 CALF
Residue:
466
  
Inhibitor
Name:
BDBM50003335
Synonyms:
CHEMBL1204345 L-691121 | N-[1''-(2-benzo[c][1,2,5]oxadiazol-5-ylethyl)-4-oxospiro[3,4-dihydro-2H-chromene-2,4''-(hexahydropyridine)]-6-yl]methanesulfonamide
Type:
Small organic molecule
Emp. Form.:
C22H24N4O5S
Mol. Mass.:
456.515
SMILES:
CS(=O)(=O)Nc1ccc2OC3(CCN(CCc4ccc5nonc5c4)CC3)CC(=O)c2c1
: