Target
Platelet-activating factor receptor
Ligand
BDBM50003497
Substrate
Meas. Tech.
ChEBML_154975
IC50
24±n/a nM
Citation
 Carceller, EAlmansa, CMerlos, MGiral, MBartrolí, JGarcía-Rafanell, JForn, J (Pyridylcyanomethyl)piperazines as orally active PAF antagonists. J Med Chem 35:4118-34 (1992)  
Target
Name:
Platelet-activating factor receptor
Synonyms:
PAF-R PTAFR_CAVPO Platelet-activating factor receptor
Type:
Protein
Mol. Mass.:
39005.63
Organism:
Cavia porcellus
Description:
Residue:
342
  
Inhibitor
Name:
BDBM50003497
Synonyms:
CHEMBL134123 {1-[2-(Benzhydryl-amino)-acetyl]-piperidin-4-yl}-pyridin-3-yl-acetonitrile; hydrate
Type:
Small organic molecule
Emp. Form.:
C27H28N4O
Mol. Mass.:
424.5374
SMILES:
O=C(CNC(c1ccccc1)c1ccccc1)N1CCC(CC1)C(C#N)c1cccnc1
: