Target
5-hydroxytryptamine receptor 2A/2B/2C
Ligand
BDBM50002204
Substrate
Meas. Tech.
ChEBML_2126
Ki
47±n/a nM
Citation
 Gilligan, PJCain, GAChristos, TECook, LDrummond, SJohnson, ALKergaye, AAMcElroy, JFRohrbach, KWSchmidt, WK Novel piperidine sigma receptor ligands as potential antipsychotic drugs. J Med Chem 35:4344-61 (1992)  
Target
Name:
5-hydroxytryptamine receptor 2A/2B/2C
Synonyms:
Serotonin 2 (5-HT2) receptor
Type:
Mol. Mass.:
Description:
ASSAY_ID of ChEMBL is 2124
Components:
This complex has 3 components.
Component 1
Name:
5-hydroxytryptamine receptor 2C
Synonyms:
5-HT2C 5-hydroxytryptamine receptor 2C (5HT2C) 5ht1c Htr1c Serotonin 2c (5-HT2c) receptor
Type:
Enzyme
Mol. Mass.:
51948.16
Organism:
Mus musculus (Mouse)
Description:
P34968
Residue:
459
  
Component 2
Name:
5-hydroxytryptamine receptor 2A
Synonyms:
5-HT-2 5-hydroxytryptamine receptor 2A 5HT2A_MOUSE Htr2 Serotonin 2a (5-HT2a) receptor
Type:
Enzyme
Mol. Mass.:
52843.00
Organism:
Mus musculus (Mouse)
Description:
P35363
Residue:
471
  
Component 3
Name:
5-hydroxytryptamine receptor 2B
Synonyms:
5-HT2 5-hydroxytryptamine receptor 2B 5HT2B_MOUSE Htr2b
Type:
Enzyme
Mol. Mass.:
53610.91
Organism:
Mus musculus (Mouse)
Description:
Q02152
Residue:
479
  
Inhibitor
Name:
BDBM50002204
Synonyms:
1-Benzyl-4-(biphenyl-4-ylmethoxymethyl)-piperidine; compound with but-2-enedioic acid;0.5hydrate | CHEMBL137658
Type:
Small organic molecule
Emp. Form.:
C26H29NO
Mol. Mass.:
371.5146
SMILES:
C(OCc1ccc(cc1)-c1ccccc1)C1CCN(Cc2ccccc2)CC1
: