Target
Sigma non-opioid intracellular receptor 1
Ligand
BDBM50002308
Substrate
Meas. Tech.
ChEBML_201877
Ki
98±n/a nM
Citation
 Gilligan, PJCain, GAChristos, TECook, LDrummond, SJohnson, ALKergaye, AAMcElroy, JFRohrbach, KWSchmidt, WK Novel piperidine sigma receptor ligands as potential antipsychotic drugs. J Med Chem 35:4344-61 (1992)  
Target
Name:
Sigma non-opioid intracellular receptor 1
Synonyms:
Opioid receptor, sigma 1 SGMR1_MOUSE Sigma1-receptor Sigmar1
Type:
Enzyme Catalytic Domain
Mol. Mass.:
25246.51
Organism:
Mus musculus (Mouse)
Description:
O55242
Residue:
223
  
Inhibitor
Name:
BDBM50002308
Synonyms:
1-[4-(1-Cyclopropylmethyl-piperidin-4-ylmethoxy)-phenyl]-ethanol | CHEMBL136702
Type:
Small organic molecule
Emp. Form.:
C18H27NO2
Mol. Mass.:
289.4125
SMILES:
CC(O)c1ccc(OCC2CCN(CC3CC3)CC2)cc1
: