Target
D(2) dopamine receptor
Ligand
BDBM50002308
Substrate
Meas. Tech.
ChEBML_58197
IC50
>10000±n/a nM
Citation
 Gilligan, PJCain, GAChristos, TECook, LDrummond, SJohnson, ALKergaye, AAMcElroy, JFRohrbach, KWSchmidt, WK Novel piperidine sigma receptor ligands as potential antipsychotic drugs. J Med Chem 35:4344-61 (1992)  
Target
Name:
D(2) dopamine receptor
Synonyms:
DOPAMINE D2 Dopamine D2 receptor Drd2
Type:
Enzyme
Mol. Mass.:
50957.64
Organism:
Mus musculus (Mouse)
Description:
P61168
Residue:
444
  
Inhibitor
Name:
BDBM50002308
Synonyms:
1-[4-(1-Cyclopropylmethyl-piperidin-4-ylmethoxy)-phenyl]-ethanol | CHEMBL136702
Type:
Small organic molecule
Emp. Form.:
C18H27NO2
Mol. Mass.:
289.4125
SMILES:
CC(O)c1ccc(OCC2CCN(CC3CC3)CC2)cc1
: