Target
Reverse transcriptase/RNaseH
Ligand
BDBM50000024
Substrate
Meas. Tech.
ChEBML_196935
IC50
45000±n/a nM
Citation
 Tan, GTWickramasinghe, ABaba, MHughes, SHMohan, PPezzuto, JMSingh, RVerma, S Potential anti-AIDS naphthalenesulfonic acid derivatives. Synthesis and inhibition of HIV-1 induced cytopathogenesis and HIV-1 and HIV-2 reverse transcriptase activities. J Med Chem 35:4846-53 (1992)  
Target
Name:
Reverse transcriptase/RNaseH
Synonyms:
HIV-1 Reverse Transcriptase RNase H Reverse transcriptase/RNaseH
Type:
PROTEIN
Mol. Mass.:
65229.15
Organism:
Human immunodeficiency virus 1
Description:
ChEMBL_1473730
Residue:
566
  
Inhibitor
Name:
BDBM50000024
Synonyms:
4,6-Diamino-5-hydroxy-naphthalene-1,3-disulfonic acid | CHEMBL144096
Type:
Small organic molecule
Emp. Form.:
C10H10N2O7S2
Mol. Mass.:
334.326
SMILES:
Nc1ccc2c(cc(c(N)c2c1O)S(O)(=O)=O)S(O)(=O)=O
: