Target
5-hydroxytryptamine receptor 1B
Ligand
BDBM50001855
Substrate
Meas. Tech.
ChEBML_1808
Ki
75±n/a nM
Citation
 Scott, MKMartin, GEDiStefano, DLFedde, CLKukla, MJBarrett, DLBaldy, WJElgin, RJKesslick, JMMathiasen, JR Pyrrole mannich bases as potential antipsychotic agents. J Med Chem 35:552-8 (1992)  
Target
Name:
5-hydroxytryptamine receptor 1B
Synonyms:
5-HT-1B 5-hydroxytryptamine receptor 1B (5HT1B) 5ht1b Serotonin 1 (5-HT1) receptor Serotonin receptor 1B
Type:
Protein
Mol. Mass.:
43173.33
Organism:
Rattus norvegicus (Rat)
Description:
P28564
Residue:
386
  
Inhibitor
Name:
BDBM50001855
Synonyms:
1-{5-[4-(2-Isopropoxy-phenyl)-piperazin-1-ylmethyl]-1-methyl-1H-pyrrol-2-ylmethyl}-azocan-2-one | CHEMBL346168
Type:
Small organic molecule
Emp. Form.:
C27H40N4O2
Mol. Mass.:
452.6321
SMILES:
CC(C)Oc1ccccc1N1CCN(Cc2ccc(CN3CCCCCCC3=O)n2C)CC1
: