Target
Cholecystokinin receptor type A
Ligand
BDBM50046112
Substrate
Meas. Tech.
ChEBML_49724
Ki
8.3±n/a nM
Citation
 Corringer, PJWeng, JHDucos, BDurieux, CBoudeau, PBohme, ARoques, BP CCK-B agonist or antagonist activities of structurally hindered and peptidase-resistant Boc-CCK4 derivatives. J Med Chem 36:166-72 (1993)  
Target
Name:
Cholecystokinin receptor type A
Synonyms:
CCK-A receptor CCK1-R CCKAR_CAVPO Cholecystokinin receptor type A | Cholecystokinin-1 receptor
Type:
Mol. Mass.:
48229.77
Organism:
Cavia porcellus
Description:
Residue:
430
  
Inhibitor
Name:
BDBM50046112
Synonyms:
3-(2-Amino-3-naphthalen-1-yl-propionylamino)-N-({[1-tert-butoxycarbonyl-2-(1H-indol-3-yl)-ethyl]-methyl-carbamoyl}-phenyl-methyl)-succinamic acid | CHEMBL3351060
Type:
Small organic molecule
Emp. Form.:
C41H45N5O7
Mol. Mass.:
719.8253
SMILES:
CN([C@@H](Cc1c[nH]c2ccccc12)C(=O)OC(C)(C)C)C(=O)[C@@H](NC(=O)[C@H](CC(O)=O)NC(=O)[C@@H](N)Cc1cccc2ccccc12)c1ccccc1
: