Target
5-hydroxytryptamine receptor 1A
Ligand
BDBM50040170
Substrate
Meas. Tech.
ChEBML_581
Ki
252±n/a nM
Citation
 Chidester, CGLin, CHLahti, RAHaadsma-Svensson, SRSmith, MW Comparison of 5-HT1A and dopamine D2 pharmacophores. X-ray structures and affinities of conformationally constrained ligands. J Med Chem 36:1301-15 (1993)  
Target
Name:
5-hydroxytryptamine receptor 1A
Synonyms:
5-HT-1A 5-hydroxytryptamine receptor 1A (5-HT-1A) ADRB2RL1 Dopamine D2 receptor and serotonin 1a receptor HTR1A | Serotonin receptor 1A
Type:
Mol. Mass.:
46122.49
Organism:
Homo sapiens (Human)
Description:
Residue:
422
  
Inhibitor
Name:
BDBM50040170
Synonyms:
(Recemic)3-Allyl-6-methoxy-2,3,3a,4,5,9b-hexahydro-1H-benzo[e]indole CHEMBL10570
Type:
Small organic molecule
Emp. Form.:
C16H21NO
Mol. Mass.:
243.344
SMILES:
COc1cccc2C3CCN(CC=C)[C@@H]3CCc12
: