Target
5-hydroxytryptamine receptor 1A
Ligand
BDBM50034313
Substrate
Meas. Tech.
ChEBML_581
Ki
>1000±n/a nM
Citation
 Chidester, CGLin, CHLahti, RAHaadsma-Svensson, SRSmith, MW Comparison of 5-HT1A and dopamine D2 pharmacophores. X-ray structures and affinities of conformationally constrained ligands. J Med Chem 36:1301-15 (1993)  
Target
Name:
5-hydroxytryptamine receptor 1A
Synonyms:
5-HT-1A 5-hydroxytryptamine receptor 1A (5-HT-1A) ADRB2RL1 Dopamine D2 receptor and serotonin 1a receptor HTR1A | Serotonin receptor 1A
Type:
Mol. Mass.:
46122.49
Organism:
Homo sapiens (Human)
Description:
Residue:
422
  
Inhibitor
Name:
BDBM50034313
Synonyms:
(3aR,9aR)-1-Allyl-5-methoxy-2,3,3a,4,9,9a-hexahydro-1H-benzo[f]indole (Recemic)1-Allyl-5-methoxy-2,3,3a,4,9,9a-hexahydro-1H-benzo[f]indole | CHEMBL281798
Type:
Small organic molecule
Emp. Form.:
C16H21NO
Mol. Mass.:
243.344
SMILES:
COc1cccc2C[C@@H]3[C@@H](CCN3CC=C)Cc12
: