Target
D(2) dopamine receptor
Ligand
BDBM50040170
Substrate
Meas. Tech.
ChEBML_59890
Ki
78±n/a nM
Citation
 Chidester, CGLin, CHLahti, RAHaadsma-Svensson, SRSmith, MW Comparison of 5-HT1A and dopamine D2 pharmacophores. X-ray structures and affinities of conformationally constrained ligands. J Med Chem 36:1301-15 (1993)  
Target
Name:
D(2) dopamine receptor
Synonyms:
D(2) dopamine receptor DOPAMINE D2 Long DRD2 Dopamine D2 receptor Dopamine D2 receptor (D2R) Dopamine2-like | d2
Type:
Cell-surface receptors
Mol. Mass.:
50647.10
Organism:
Homo sapiens (Human)
Description:
P14416
Residue:
443
  
Inhibitor
Name:
BDBM50040170
Synonyms:
(Recemic)3-Allyl-6-methoxy-2,3,3a,4,5,9b-hexahydro-1H-benzo[e]indole CHEMBL10570
Type:
Small organic molecule
Emp. Form.:
C16H21NO
Mol. Mass.:
243.344
SMILES:
COc1cccc2C3CCN(CC=C)[C@@H]3CCc12
: