Target
Gastrin/cholecystokinin type B receptor
Ligand
BDBM50006842
Substrate
Meas. Tech.
ChEBML_48760
IC50
81±n/a nM
Citation
 Patchett, AA Excursions in drug discovery. J Med Chem 36:2051-8 (1993)  
Target
Name:
Gastrin/cholecystokinin type B receptor
Synonyms:
CCK-2 receptor CCK-BR CCKRB Cholecystokinin receptor GASR_HUMAN | Gastrin/cholecystokinin type B receptor
Type:
G Protein-Coupled Receptor (GPCR)
Mol. Mass.:
48445.79
Organism:
Homo sapiens (Human)
Description:
Stable expression of human CCK-2 receptors in HEK 293 cells.
Residue:
447
  
Inhibitor
Name:
BDBM50006842
Synonyms:
2-[2-(5-Bromo-1H-indol-3-yl)-ethyl]-3-(3-isopropoxy-phenyl)-3H-quinazolin-4-one | CHEMBL37312
Type:
Small organic molecule
Emp. Form.:
C27H24BrN3O2
Mol. Mass.:
502.402
SMILES:
CC(C)Oc1cccc(c1)-n1c(CCc2c[nH]c3ccc(Br)cc23)nc2ccccc2c1=O
: