Target
Angiotensin-converting enzyme
Ligand
BDBM50044230
Substrate
Meas. Tech.
ChEBML_36748
IC50
4900±n/a nM
Citation
 Patchett, AA Excursions in drug discovery. J Med Chem 36:2051-8 (1993)  
Target
Name:
Angiotensin-converting enzyme
Synonyms:
ACE Angiotensin converting enzyme (ACE) Angiotensin-converting enzyme, soluble form CD_antigen=CD143 DCP1 Kininase II
Type:
Enzyme
Mol. Mass.:
149709.01
Organism:
Homo sapiens (Human)
Description:
Residue:
1306
  
Inhibitor
Name:
BDBM50044230
Synonyms:
1-(4-Carboxy-2-methyl-butyryl)-pyrrolidine-2-carboxylic acid | CHEMBL62678
Type:
Small organic molecule
Emp. Form.:
C11H17NO5
Mol. Mass.:
243.2564
SMILES:
C[C@@H](CCC(O)=O)C(=O)N1CCCC1C(O)=O
: