Target
D(3) dopamine receptor
Ligand
BDBM50456207
Substrate
Meas. Tech.
ChEBML_61346
Ki
0.210000±n/a nM
Citation
 Mach, RHLuedtke, RRUnsworth, CDBoundy, VANowak, PAScripko, JGElder, STJackson, JRHoffman, PLEvora, PH 18F-labeled benzamides for studying the dopamine D2 receptor with positron emission tomography. J Med Chem 36:3707-20 (1994)  
Target
Name:
D(3) dopamine receptor
Synonyms:
DOPAMINE D3 DRD3_HUMAN Dopamine D3 receptor (D3) Dopamine receptor Dopamine receptor D3
Type:
Mol. Mass.:
44243.43
Organism:
Homo sapiens (Human)
Description:
Residue:
400
  
Inhibitor
Name:
BDBM50456207
Synonyms:
CHEMBL2112607
Type:
Small organic molecule
Emp. Form.:
C24H29FN2O3
Mol. Mass.:
412.4971
SMILES:
COc1cccc(C(=O)NC2CC3CCCC(C2)N3Cc2ccc(F)cc2)c1OC
: