Target
Cholecystokinin receptor type A
Ligand
BDBM50033596
Substrate
Meas. Tech.
ChEMBL_50061 (CHEMBL662430)
IC50
1810±n/a nM
Citation
 Boden, PRHigginbottom, MHill, DRHorwell, DCHughes, JRees, DCRoberts, ESingh, LSuman-Chauhan, NWoodruff, GN Cholecystokinin dipeptoid antagonists: design, synthesis, and anxiolytic profile of some novel CCK-A and CCK-B selective and"mixed" CCK-A/CCK-B antagonists. J Med Chem 36:552-65 (1993)  
Target
Name:
Cholecystokinin receptor type A
Synonyms:
CCKAR_RAT Cholecystokinin peripheral Cholecystokinin receptor type A
Type:
Enzyme Catalytic Domain
Mol. Mass.:
49676.37
Organism:
RAT
Description:
Cholecystokinin central 0 RAT::P30551
Residue:
444
  
Inhibitor
Name:
BDBM50033596
Synonyms:
CHEMBL153557 | N-{2-[3-(1H-Indol-3-yl)-2-methyl-2-(2-methyl-cyclohexyloxycarbonylamino)-propionylamino]-1-phenyl-ethyl}-succinamic acid
Type:
Small organic molecule
Emp. Form.:
C32H40N4O6
Mol. Mass.:
576.6832
SMILES:
C[C@H]1CCCCC1OC(=O)N[C@](C)(Cc1c[nH]c2ccccc12)C(=O)NC[C@H](NC(=O)CCC(O)=O)c1ccccc1
: