Target
5-hydroxytryptamine receptor 1A
Ligand
BDBM50007170
Substrate
Meas. Tech.
ChEMBL_1300 (CHEMBL616677)
Kd
0.40±n/a nM
Citation
 Zhuang, ZPKung, MPKung, HF Synthesis and evaluation of 4-(2'-methoxyphenyl)-1-[2'-[N-(2"-pyridinyl)-p- iodobenzamido]ethyl]piperazine (p-MPPI): a new iodinated 5-HT1A ligand. J Med Chem 37:1406-7 (1994)  
Target
Name:
5-hydroxytryptamine receptor 1A
Synonyms:
5-HT-1A 5-HT1A 5-hydroxytryptamine receptor 1A (5HT1A) 5ht1a Htr1a Serotonin 1a (5-HT1a) receptor/Adrenergic receptor alpha-1 | Serotonin receptor 1A
Type:
G Protein-Coupled Receptor (GPCR)
Mol. Mass.:
46445.29
Organism:
Rattus norvegicus (rat)
Description:
Binding assays were performed using rat hippocampal membranes.
Residue:
422
  
Inhibitor
Name:
BDBM50007170
Synonyms:
Adamantane-1-carboxylic acid {4-[4-(2-methoxy-phenyl)-piperazin-1-yl]-butyl}-amide | CHEMBL26533
Type:
Small organic molecule
Emp. Form.:
C26H39N3O2
Mol. Mass.:
425.6068
SMILES:
COc1ccccc1N1CCN(CCCCNC(=O)C23C[C@H]4C[C@H](C[C@H](C4)C2)C3)CC1
: