Target
Muscarinic acetylcholine receptor M2
Ligand
BDBM50368857
Substrate
Meas. Tech.
ChEMBL_140094 (CHEMBL752971)
EC50
11000±n/a nM
Citation
 Botero Cid, MHHolzgrabe, UKostenis, EMohr, KTränkle, C Search for the pharmacophore of bispyridinium-type allosteric modulators of muscarinic receptors. J Med Chem 37:1439-45 (1994)  
Target
Name:
Muscarinic acetylcholine receptor M2
Synonyms:
ACM2_PIG Cholinergic, muscarinic LOC100715343 Muscarinic receptor 2
Type:
Enzyme Catalytic Domain
Mol. Mass.:
51688.65
Organism:
GUINEA PIG
Description:
Cholinergic, muscarinic 0 GUINEA PIG::P06199
Residue:
466
  
Inhibitor
Name:
BDBM50368857
Synonyms:
CHEMBL1202147
Type:
Small organic molecule
Emp. Form.:
C22H22Cl2N4O2
Mol. Mass.:
445.341
SMILES:
Clc1cccc(Cl)c1CO\N=C\c1cc[n+](CCC[n+]2ccc(CN=O)cc2)cc1
: