Target
5-hydroxytryptamine receptor 2A
Ligand
BDBM50036846
Substrate
Meas. Tech.
ChEMBL_2107 (CHEMBL617142)
IC50
>1000000±n/a nM
Citation
 Podona, TGuardiola-Lemaître, BCaignard, DHAdam, GPfeiffer, BRenard, PGuillaumet, G 3,4-Dihydro-3-amino-2H-1-benzopyran derivatives as 5-HT1A receptor ligands and potential anxiolytic agents. 1. Synthesis and structure--activity relationship studies. J Med Chem 37:1779-93 (1994)  
Target
Name:
5-hydroxytryptamine receptor 2A
Synonyms:
5-HT2A 5HTR2A Serotonin 2a (5-HT2a) receptor
Type:
Enzyme Catalytic Domain
Mol. Mass.:
52578.24
Organism:
BOVINE
Description:
5-HT2A HTR2A BOVINE::Q75Z89
Residue:
470
  
Inhibitor
Name:
BDBM50036846
Synonyms:
(5-Methoxy-chroman-3-yl)-(4-piperidin-1-yl-butyl)-propyl-amine | CHEMBL416747
Type:
Small organic molecule
Emp. Form.:
C22H36N2O2
Mol. Mass.:
360.5334
SMILES:
CCCN(CCCCN1CCCCC1)C1COc2cccc(OC)c2C1
: