Target
5-hydroxytryptamine receptor 1A
Ligand
BDBM50036847
Substrate
Meas. Tech.
ChEMBL_835 (CHEMBL615835)
IC50
3±n/a nM
Citation
 Podona, TGuardiola-Lemaître, BCaignard, DHAdam, GPfeiffer, BRenard, PGuillaumet, G 3,4-Dihydro-3-amino-2H-1-benzopyran derivatives as 5-HT1A receptor ligands and potential anxiolytic agents. 1. Synthesis and structure--activity relationship studies. J Med Chem 37:1779-93 (1994)  
Target
Name:
5-hydroxytryptamine receptor 1A
Synonyms:
5-HT-1A 5-HT1A 5-hydroxytryptamine receptor 1A (5HT1A) 5ht1a Htr1a Serotonin 1a (5-HT1a) receptor/Adrenergic receptor alpha-1 | Serotonin receptor 1A
Type:
G Protein-Coupled Receptor (GPCR)
Mol. Mass.:
46445.29
Organism:
Rattus norvegicus (rat)
Description:
Binding assays were performed using rat hippocampal membranes.
Residue:
422
  
Inhibitor
Name:
BDBM50036847
Synonyms:
CHEMBL54266 | N-{3-[(5-Methoxy-chroman-3-yl)-propyl-amino]-propyl}-4-methyl-benzenesulfonamide; compound with oxalic acid
Type:
Small organic molecule
Emp. Form.:
C23H32N2O4S
Mol. Mass.:
432.576
SMILES:
CCCN(CCCNS(=O)(=O)c1ccc(C)cc1)C1COc2cccc(OC)c2C1
: