Target
Alpha-1A adrenergic receptor
Ligand
BDBM50036846
Substrate
Meas. Tech.
ChEMBL_32974 (CHEMBL644689)
IC50
5000±n/a nM
Citation
 Podona, TGuardiola-Lemaître, BCaignard, DHAdam, GPfeiffer, BRenard, PGuillaumet, G 3,4-Dihydro-3-amino-2H-1-benzopyran derivatives as 5-HT1A receptor ligands and potential anxiolytic agents. 1. Synthesis and structure--activity relationship studies. J Med Chem 37:1779-93 (1994)  
Target
Name:
Alpha-1A adrenergic receptor
Synonyms:
ADA1A_BOVIN ADRA1C Alpha 1A-adrenoreceptor Cerebral cortex alpha adrenergic receptor | adrenergic Alpha1
Type:
Enzyme Catalytic Domain
Mol. Mass.:
51492.08
Organism:
CALF
Description:
adrenergic Alpha1 0 CALF
Residue:
466
  
Inhibitor
Name:
BDBM50036846
Synonyms:
(5-Methoxy-chroman-3-yl)-(4-piperidin-1-yl-butyl)-propyl-amine | CHEMBL416747
Type:
Small organic molecule
Emp. Form.:
C22H36N2O2
Mol. Mass.:
360.5334
SMILES:
CCCN(CCCCN1CCCCC1)C1COc2cccc(OC)c2C1
: