Target
D(2) dopamine receptor
Ligand
BDBM50036849
Substrate
Meas. Tech.
ChEMBL_59314 (CHEMBL670208)
IC50
40±n/a nM
Citation
 Podona, TGuardiola-Lemaître, BCaignard, DHAdam, GPfeiffer, BRenard, PGuillaumet, G 3,4-Dihydro-3-amino-2H-1-benzopyran derivatives as 5-HT1A receptor ligands and potential anxiolytic agents. 1. Synthesis and structure--activity relationship studies. J Med Chem 37:1779-93 (1994)  
Target
Name:
D(2) dopamine receptor
Synonyms:
DOPAMINE D2 DRD2_BOVIN | Dopamine D2 receptor
Type:
Enzyme Catalytic Domain
Mol. Mass.:
50698.79
Organism:
BOVINE
Description:
P20288
Residue:
444
  
Inhibitor
Name:
BDBM50036849
Synonyms:
1-{4-[(5-Methoxy-chroman-3-yl)-propyl-amino]-butyl}-4,4-dimethyl-piperidine-2,6-dione; compound with oxalic acid | CHEMBL52485
Type:
Small organic molecule
Emp. Form.:
C24H36N2O4
Mol. Mass.:
416.5536
SMILES:
CCCN(CCCCN1C(=O)CC(C)(C)CC1=O)C1COc2cccc(OC)c2C1
: