Target
D(2) dopamine receptor
Ligand
BDBM50036847
Substrate
Meas. Tech.
ChEMBL_59314 (CHEMBL670208)
IC50
30±n/a nM
Citation
 Podona, TGuardiola-Lemaître, BCaignard, DHAdam, GPfeiffer, BRenard, PGuillaumet, G 3,4-Dihydro-3-amino-2H-1-benzopyran derivatives as 5-HT1A receptor ligands and potential anxiolytic agents. 1. Synthesis and structure--activity relationship studies. J Med Chem 37:1779-93 (1994)  
Target
Name:
D(2) dopamine receptor
Synonyms:
DOPAMINE D2 DRD2_BOVIN | Dopamine D2 receptor
Type:
Enzyme Catalytic Domain
Mol. Mass.:
50698.79
Organism:
BOVINE
Description:
P20288
Residue:
444
  
Inhibitor
Name:
BDBM50036847
Synonyms:
CHEMBL54266 | N-{3-[(5-Methoxy-chroman-3-yl)-propyl-amino]-propyl}-4-methyl-benzenesulfonamide; compound with oxalic acid
Type:
Small organic molecule
Emp. Form.:
C23H32N2O4S
Mol. Mass.:
432.576
SMILES:
CCCN(CCCNS(=O)(=O)c1ccc(C)cc1)C1COc2cccc(OC)c2C1
: