Target
5-hydroxytryptamine receptor 2A
Ligand
BDBM50036851
Substrate
Meas. Tech.
ChEMBL_2107 (CHEMBL617142)
IC50
2000±n/a nM
Citation
 Podona, TGuardiola-Lemaître, BCaignard, DHAdam, GPfeiffer, BRenard, PGuillaumet, G 3,4-Dihydro-3-amino-2H-1-benzopyran derivatives as 5-HT1A receptor ligands and potential anxiolytic agents. 1. Synthesis and structure--activity relationship studies. J Med Chem 37:1779-93 (1994)  
Target
Name:
5-hydroxytryptamine receptor 2A
Synonyms:
5-HT2A 5HTR2A Serotonin 2a (5-HT2a) receptor
Type:
Enzyme Catalytic Domain
Mol. Mass.:
52578.24
Organism:
BOVINE
Description:
5-HT2A HTR2A BOVINE::Q75Z89
Residue:
470
  
Inhibitor
Name:
BDBM50036851
Synonyms:
8-[4-(Chroman-3-yl-propyl-amino)-butyl]-8-aza-spiro[4.5]decane-7,9-dione; compound with oxalic acid | CHEMBL50993
Type:
Small organic molecule
Emp. Form.:
C25H36N2O3
Mol. Mass.:
412.5649
SMILES:
CCCN(CCCCN1C(=O)CC2(CCCC2)CC1=O)C1COc2ccccc2C1
: